programme_id,Title,Production Start,Qualities,Runtime,Title,Programme,New Video / File Name,New Video URL (Onsight to Fill In),Video Being Replaced/Removed,external_id,poster_url,Video ID,Imported?
418,Lost Songs: The Basement Tapes Continued,01/01/2014,HD,1 x 105' ,,The Basement Tapes Continued,Lost Songs: The Basement Tapes Continued - Trailer,Batch 2 of Screeners/BATCH1/Lost Songs - The Basement Tapes Continued - Trailer.mp4,Trailer,basement-tapes-trailer-2.mp4,,294,
418,Lost Songs: The Basement Tapes Continued,02/01/2014,HD,2 x 105' ,Lost Songs,The Basement Tapes Continued,Lost Songs: The Basement Tapes Continued - Screener,Batch 2 of Screeners/BATCH1/Lost Songs - The Basement Tapes Continued - Screener.mp4,,,,new,
422,Muse: Live At Rome Olympic Stadium,01/01/2014,"4K, HD, SD",1 x 60' / 1 x 90',Muse,Live At Rome Olympic Stadium,Live At Rome Olympic Stadium - Muse - Screener,Batch 2 of Screeners/BATCH1/Live At Rome Olympic Stadium - Muse - 60' Screener.mp4,Muse - Live in Rome,muse---live-in-rome-90'.mp4,,345,
425,Shania Twain: Still The One - Live In Las Vegas,01/01/2014,HD,1 x 60' / 1 x 90'  ,Shania Twain,Still The One - Live In Las Vegas,Still The One: Live In Las Vegas - Shania Twain - Screener,Batch 2 of Screeners/BATCH1/Still The One - Live In Las Vegas - Shania Twain - 60' Screener.mp4,Shania Twain: Still The One,shania---still-the-one-.mov.mp4,,288,
426,Status Quo: The Frantic Four's Final Fling,01/01/2014,HD,1 x 110' ,Status Quo,The Frantic Four's Final Fling,The Frantic Four's Final Fling - Status Quo - Screener,Batch 2 of Screeners/BATCH14/The Frantic Four's Final Fling - Status Quo - Screener.mp4,Status Quo: The Frantic Four's Final Fling,s-quo-johnny-b-goode-ffff.mp4,,306,
386,Alfie Boe: Storyteller - Live At The Royal Albert Hall,01/01/2013,HD,1 x 105' ,Alfie Boe,Storyteller - Live At The Royal Albert Hall,Storyteller: Live At The Royal Albert Hall - Alfie Boe - Screener,Batch 2 of Screeners/BATCH1/Storyteller - Live At The Royal Albert Hall - Alfie Boe - Screener.mov.mp4,Alfie Boe Storyteller - Live At The Royal Albert Hall,alfie-boe-storyteller---live-at-the-royal-albert-hall.mp4,,295,
387,Born In Chicago,01/01/2013,HD,1 x 77',Born In Chicago,Born In Chicago,Born In Chicago - Screener,Batch 2 of Screeners/BATCH1/Born In Chicago - Screener.mp4,Born In Chicago,born-in-chicago---clean.mp4,,484,
388,Brian May & Kerry Ellis: Live By Candlelight At Montreux,01/01/2013,HD,1 x 90' ,Brian May & Kerry Ellis,Live By Candlelight At Montreux,Live By Candlelight At Montreux - Brian May & Kerry Ellis - Screener,Batch 2 of Screeners/BATCH1/Live By Candlelight At Montreux - Brian May & Kerry Ellis - Screener.mov.mp4,Dust In The Wind,brian-may-+-kerry-ellis-dust-in-the-wind.mp4,,236,
390,Cee Lo Green: Live In Las Vegas,01/01/2013,HD,1 x 60' / 1 x 90'   ,Cee Lo Green,Live In Las Vegas,Live In Las Vegas - Cee Lo Green - Screener,Batch 2 of Screeners/BATCH1/Live In Las Vegas - Cee Lo Green - 60' Screener.mov.mp4,Cee Lo Green - Live,cee-lo-green---live.mp4,,139,
391,Elliott Smith: Heaven Adores You,01/01/2013,"HD, SD",1 x 105',,Heaven Adores You,Heaven Adores You - Elliott Smith - Trailer,Batch 2 of Screeners/BATCH1/Heaven Adores You - Elliott Smith - Trailer.mp4,Trailer,hay-trailer-texted-02-03-15-1.mp4,,291,
391,Elliott Smith: Heaven Adores You,02/01/2013,"HD, SD",2 x 105',Elliott Smith,Heaven Adores You,Heaven Adores You - Elliott Smith - Screener,Batch 2 of Screeners/BATCH1/Heaven Adores You - Elliott Smith - Screener.mp4,Elliott Smith: Heaven Adores You,elliot-smith.mp4,,290,
392,Elton John: Million Dollar Piano Live In Las Vegas,01/01/2013,HD,1 x 60' / 1 x 110'  ,,Million Dollar Piano Live In Las Vegas,Million Dollar Piano Live In Las Vegas - Elton John - Screener,Batch 2 of Screeners/BATCH1/Million Dollar Piano Live In Las Vegas - Elton John - 60' Screener.mp4,Elton John - Million Dollar Piano 60,elton-john---million-dollar-piano-60.mp4,,240,
394,Eric Clapton: Crossroads Guitar Festival 2013,01/01/2013,HD,1 x 1' ,Eric Clapton,Crossroads Guitar Festival 13,Crossroads Guitar Festival 2013 - Eric Clapton - Screener,Batch 2 of Screeners/BATCH1/Crossroads Guitar Festival 2013 - Eric Clapton - Screener.mp4,Eric Clapton: Crossroads Guitar Festival 13,eric-clapton-crossroads-guitar-festival-13.mp4,,206,
398,Morrissey: 25 Live,01/01/2013,HD,1 x 60' / 1 x 90'   ,Morrissey,25 Live,25 Live - Morrissey - Screener,Batch 2 of Screeners/BATCH1/25 Live - Morrissey - 60' Screener.mp4,November Spawned a Monster,morrissey-november-spawned-a-monster-la.mp4,,172,
399,Peter Gabriel: Back To Front - Live At The O2,01/01/2013,"4K, HD, SD",1 x 60' / 1 x 100',Peter Gabriel,Back To Front - Live At The O2,Back To Front: Live At The O2 - Peter Gabriel - Screener,Batch 2 of Screeners/BATCH14/Back To Front- Live At The O2 - Peter Gabriel - 60' Screener.mp4,Peter Gabriel - Back To Front,peter-gabriel-back-to-front_screener.mp4,,237,
400,Plan B: The Grindhouse Tour - Live At The O2,01/01/2013,HD,1 x 90' ,Plan B,The Grindhouse Tour - Live At The O2,The Grindhouse Tour: Live At The O2 - Plan B - Screener,Batch 2 of Screeners/BATCH1/The Grindhouse Tour - Live At The O2 - Plan B - Screener.mov.mp4,Plan B - Grindhouse Tour,plan-b---grindhouse-tour.mp4,,205,
401,Rob Zombie: The Zombie Horror Picture Show,01/01/2013,HD,1 x 55' ,Rob Zombie,The Zombie Horror Picture Show,The Zombie Horror Picture Show - Rob Zombie - Screener,Batch 2 of Screeners/BATCH2/The Zombie Horror Picture Show - Rob Zombie - Screener.mp4,Rob Zombie: The Zombie Horror Picture Show - WARNING Explicit content,zombie-horror-picture-show.mp4,,272,
403,Sepultura: Alive At Rock In Rio,01/01/2013,HD,1 x 60' ,Sepultura,Alive At Rock In Rio,Alive At Rock In Rio - Sepultura - Screener,Batch 2 of Screeners/BATCH2/Alive At Rock In Rio - Sepultura - Screener.mp4,Sepultura: Alive at Rock in Rio,sepultura---alive-at-rock-in-rio.mp4,,285,
407,Toto: 35th Anniversary Tour - Live From Poland,01/01/2013,HD,1 x 60' / 1 x 1' ,Toto,35th Anniversary Tour - Live From Poland,35th Anniversary Tour: Live From Poland - Toto - Screener,Batch 2 of Screeners/BATCH2/35th Anniversary Tour - Live From Poland - Toto - 60' Screener.mp4,,,,new,
368,Alanis Morissette: Live At Montreux,01/01/2012,HD,1 x 60' / 1 x 1'  ,Alanis Morissette,Live At Montreux,Live At Montreux 2012 - Alanis Morissette - Screener,Batch 2 of Screeners/BATCH2/Live At Montreux 2012 - Alanis Morissette - 60' Screener.mp4,You Learn,alanis-morissette---live-at-montreux---you-learn.mp4,,143,
370,Eric Idle's What About Dick,01/01/2012,HD,1 x 80' ,Eric Idle's What About Dick,Eric Idle's What About Dick,Eric Idle's What About Dick - Screener,Batch 2 of Screeners/BATCH2/Eric Idle's What About Dick - Screener.mp4,,,,new,
372,Garbage: One Mile High...Live,01/01/2012,HD,1 x 60' / 1 x 90'   ,Garbage,One Mile High...Live,One Mile High...Live - Garbage - Screener,Batch 2 of Screeners/BATCH2/One Mile High...Live - Garbage - 60' Screener.mp4,Stupid Girl,garbage---one-mile-high-live---stupid-girl.mp4,,138,
375,Lady Antebellum: Own The Night World Tour,01/01/2012,HD,1 x 90'  ,Lady Antebellum,Own The Night World Tour,Own The Night World Tour - Lady Antebellum - Screener,Batch 2 of Screeners/BATCH2/Own The Night World Tour - Lady Antebellum - Screener.mp4,Own The Night World Tour,lady-antebellum---own-the-night-world-tour.mp4,,127,
376,Megadeth: Countdown To Extinction - Live,01/01/2012,HD,1 x 95' ,Megadeth,Countdown To Extinction - Live,Countdown To Extinction: Live - Megadeth - Screener,Batch 2 of Screeners/BATCH2/Countdown To Extinction - Live - Megadeth - Screener.mp4,Megadeth: Countdown To Extinction - Live,megadeth-opening.mp4,,260,
380,Ringo Starr And His All Star Band: Ringo At The Ryman,01/01/2012,SD,1 x 1' ,Ringo Starr And His All Star Band,Ringo At The Ryman,Ringo At The Ryman - Ringo Starr And His All Star Band - Screener,Batch 2 of Screeners/BATCH2/Ringo At The Ryman - Ringo Starr And His All Star Band - Screener.mp4,Ringo Starr And His All Star Band: Ringo At The Ryman ,yellow-submarine-ringo-starr-1.mp4,,301,
381,Scorpions: Forever And A Day - Live In Munich,01/01/2012,SD,1 x 110',Scorpions,Forever And A Day - Live In Munich,Forever And A Day: Live In Munich - Scorpions - Screener,Batch 2 of Screeners/BATCH2/Forever And A Day - Live In Munich - Scorpions - Screener.mp4,Scorpions: Live In Munich,scorpions---scorpions---forever-and-a-day---live-in-munich---website.mp4,,351,
382,Secret Policeman's Ball 2012,01/01/2012,HD,1 x 60' / 1 x 90'   ,Secret Policeman's Ball 12,Secret Policeman's Ball 2012,Secret Policeman's Ball 2012 - Screener,Batch 2 of Screeners/BATCH14/Secret Policeman's Ball 2012 - 60' Screener.mp4,Secret Policeman's Ball 12,secret-policeman's-ball-12.mp4,https://d1k5inh2ckf6qi.cloudfront.net/mercury/uploads/video/poster/113/thumbnailscreenersecretpoliceman-2d8047589a79a2e16396.png,113,
383,The Dukes Of September: Live At Lincoln Center,01/01/2012,HD,1 x 90' ,The Dukes Of September,Live At Lincoln Center,Live At Lincoln Center - The Dukes Of September - Screener,Batch 2 of Screeners/BATCH14/Live At Lincoln Center - The Dukes Of September - Screener.mp4,The Dukes Of September: Live At Lincoln Center,dukes-sept-whos-that-lady.mp4,,280,
341,Aerosmith: Rock For The Rising Sun,01/01/2011,HD,1 x 90' ,Aerosmith,Rock For The Rising Sun,Rock For The Rising Sun - Aerosmith - Screener,Batch 2 of Screeners/BATCH14/Rock For The Rising Sun - Aerosmith - Screener.mp4,Rock For The Rising Sun - Walk This Way,aerosmith---rock-for-the-rising-sun---walk-this-way.mp4,,140,
342,B52s: With The Wild Crowd! Live in Athens,01/01/2011,HD,1 x 60' / 1 x 90'   ,B52s,With The Wild Crowd! Live in Athens,With The Wild Crowd! Live in Athens - B52s - Screener,Batch 2 of Screeners/BATCH14/With The Wild Crowd! Live in Athens - B52s - Screener.mp4,Love Shack,the-b-52s---love-shack-with-the-wild-crowd.mp4,,183,
344,Chase & Status: Live At Brixton Academy,01/01/2011,HD,1 x 85' ,Chase & Status,Live At Brixton Academy,Live At Brixton Academy - Chase & Status - Screener,Batch 2 of Screeners/BATCH2/Live At Brixton Academy - Chase & Status - Screener.mp4,Chase & Status: Live At Brixton Academy,chase-&-status.mp4,,268,
345,Deep Purple: Live In Verona,01/01/2011,HD,1 x 100',Deep Purple,Live In Verona,Live In Verona - Deep Purple - Screener,Batch 2 of Screeners/BATCH2/Live In Verona - Deep Purple - Screener.mp4,Deep Purple: Live In Verona,deep-purple-verona-clip.mp4,,284,
346,Deep Purple: Live with Orchestra - Montreux 2011,01/01/2011,HD,1 x 112',Deep Purple,Live with Orchestra - Montreux 11,Live With Orchestra: Montreux 2011 - Deep Purple - Screener,Batch 2 of Screeners/BATCH2/Live With Orchestra - Montreux 2011 - Deep Purple - Screener.mp4,Smoke On The Water,deep-purple---live-at-montreux-with-orchestra---smoke-on-the-water.mp4,,83,
347,Duran Duran: A Diamond In The Mind - Live at MEN 2011,01/01/2011,HD,1 x 60' / 1 x 90'   ,Duran Duran,A Diamond In The Mind - Live at MEN 11,A Diamond In The Mind: Live at MEN 2011 - Duran Duran - Screener,Batch 2 of Screeners/BATCH2/A Diamond In The Mind - Live at MEN 2011 - Duran Duran - 60' Screener.mp4,Wild Boys,duran-duran-a-diamond-in-the-mind---live-at-men-11.mp4,,8,
348,Elvis Costello & The Imposters: The Return Of The Spectacular Spinning Songbook ,01/01/2011,HD,1 x 60' ,Elvis Costello & The Imposters,The Return Of The Spectacular Spinning Songbook,The Return Of The Spectacular Spinning Songbook  - Elvis Costello & The Imposters - Screener,Batch 2 of Screeners/BATCH2/The Return of the Spectacular Spinning Songbook - Elvis Costello & The Imposters - Screener.mp4,Elvis Costello: The Return Of The Spectacular Singing Songbook,elvis-costello-spinning-songbook-10-mins.mp4,,270,
349,George Martin: Produced By George Martin,01/01/2011,HD,1 x 90',George Martin,Produced By George Martin,Produced By George Martin - George Martin - Screener,Batch 2 of Screeners/BATCH14/Produced By George Martin - George Martin - Screener.mp4,Produced By George Martin,george-martin---produced-by-(3).mp4,,86,
350,Kasabian: Live At The O2 ,01/01/2011,HD,1 x 60' / 1 x 90'   ,Kasabian,Live At The O2,Live At The O2 - Kasabian - Screener,Batch 2 of Screeners/BATCH3/Live At The O2 - Kasabian - 60' Screener.mp4,Fire,kasabian---fire_live-at-the-o2.mp4,,9,
351,Lindsey Buckingham: Songs From The Small Machine,01/01/2011,HD,1 x 60' / 1 x 90'   ,Lindsey Buckingham,Songs From The Small Machine,Songs From The Small Machine - Lindsey Buckingham - Screener,Batch 2 of Screeners/BATCH14/Songs From The Small Machine - Lindsey Buckingham - 60' Screener.mp4,Go Your Own Way,lindsey-buckingham---go-your-own-way.mp4,,160,
352,Mark Knopfler: A Life In Songs,01/01/2011,SD,1 x 50',Mark Knopfler,A Life In Songs,A Life In Songs - Mark Knopfler - Screener,Batch 2 of Screeners/BATCH3/A Life In Songs - Mark Knopfler - Screener.mp4,Mark Knopfler: A Life In Songs,mark-knopfler-doco-website-clip-1.m4v,,300,
355,Peter Frampton: Live,01/01/2011,HD,1 x 60' / 1 x 90'   ,Peter Frampton,Live,Live - Peter Frampton - Screener,Batch 2 of Screeners/BATCH14/Live - Peter Frampton - 60' Screener.mp4,"Baby, I Love Your Way","peter-frampton---live---baby,-i-love-your-way.mp4",,146,
356,Peter Gabriel: New Blood Live,01/01/2011,"3D, HD",1 x 60' / 1 x 90',Peter Gabriel,New Blood Live,New Blood Live - Peter Gabriel - Screener,Batch 2 of Screeners/BATCH3/New Blood Live - Peter Gabriel - 60' Screener.mp4,Peter Gabriel - New Blood Live,peter-gabriel---new-blood-live---60-cut-down.mp4,,13,
357,Placebo: Coming Up For Air,01/01/2011,HD,1 x 90' ,Placebo,Coming Up For Air,Coming Up For Air - Placebo - Screener,Batch 2 of Screeners/BATCH3/Coming Up For Air - Placebo - Screener.mp4,Coming Up For Air,placebo-coming-up-for-air.mp4,,25,
358,Placebo: We Come In Pieces - Battle For Brixton,01/01/2011,HD,1 x 60' / 1 x 90'   ,Placebo,We Come In Pieces - Battle For Brixton,We Come In Pieces: Battle For Brixton - Placebo - Screener,Batch 2 of Screeners/BATCH14/We Come In Pieces- Battle For Brixton - Placebo - 60' Screener.mp4,,,,new,
360,Rush: Time Machine - Live in Cleveland,01/01/2011,HD,1 x 163'  ,Rush,Time Machine - Live in Cleveland,Time Machine - Live in Cleveland - Rush - Screener,Batch 2 of Screeners/BATCH3/Time Machine - Live in Cleveland - Rush - Screener.mp4,,,,new,
361,Santana & John McLaughlin: Invitation To Illumination - Live At Montreux,01/01/2011,HD,1 x 1' ,Santana & John McLaughlin,Invitation To Illumination - Live At Montreux,Invitation To Illumination: Live At Montreux 2011 - Santana & John McLaughlin - Screener,Batch 2 of Screeners/BATCH3/Invitation To Illumination - Live At Montreux 2011 - Santana & John McLaughlin - Screener.mp4,The Life Divine,john-mclaughlin-&-santana---the-life-divine-montreux-11.mp4,,188,
362,Santana: Greatest Hits - Live at Montreux 2011,01/01/2011,HD,1 x 90' / 1 x 180'   ,Santana,Greatest Hits - Live at Montreux 11,Greatest Hits: Live at Montreux 2011 - Santana - Screener,Batch 2 of Screeners/BATCH3/Greatest Hits - Live at Montreux 2011 - Santana - 90' Screener.mp4,Maria Maria,santana---maria-maria_greatest-hits---montreux-11.mp4,,12,
363,Slash: Made In Stoke 24.7.11,01/01/2011,HD,1 x 60' / 1 x 90'   ,Slash,Made In Stoke 24.7.11,Made In Stoke 24.7.11 - Slash - Screener,Batch 2 of Screeners/BATCH3/Made In Stoke 24.7.11 - Slash - 60' Screener.mp4,Sweet Child O' Mine,slash-sweet-child.mp4,,10,
364,Sting: Live In Berlin,01/01/2011,HD,1 x 105' ,Sting,Live In Berlin,Live In Berlin - Sting - Screener,Batch 2 of Screeners/BATCH3/Live In Berlin - Sting - Screener.mp4,Sting: Live In Berlin,sting-berlin.mp4,,274,
367,The Hollies: Look Through Any Window 1963-1975,01/01/2011,SD,,The Hollies,Look Through Any Window 1963-1975,Look Through Any Window 1963-1975 - The Hollies - Screener,Batch 2 of Screeners/BATCH3/Look Through Any Window 1963-1975 - The Hollies - Screener.mp4,Look Through Any Window - Clip,the-hollies---look-through-any-window---clip.mp4,,115,
322,Bee Gees: In Our Own Time,01/01/2010,HD,1 x 60',Bee Gees,In Our Own Time,In Our Own Time - Bee Gees - Screener,Batch 2 of Screeners/BATCH3/In Our Own Time - Bee Gees - 60' Screener.mp4,In Our Own Time ,bee-gees---in-our-own-time-1x60.mp4,,15,
326,Eric Clapton: Crossroads Guitar Festival 2010,01/01/2010,HD,1 x 60' / 1 x 90'   ,Eric Clapton,Crossroads Guitar Festival 10,Crossroads Guitar Festival 2010 - Eric Clapton - Screener,Batch 2 of Screeners/BATCH14/Crossroads Guitar Festival 2010 - Eric Clapton - 60' Screener.mp4,I Shot The Sheriff,eric-clapton---crossroads-10---i-shot-the-sheriff.mp4,,40,
327,Jeff Beck: Rock'n'Roll Jukebox - A Tribute To Les Paul,01/01/2010,HD,1 x 60' / 1 x 90'   ,Jeff Beck,Rock'n'Roll Jukebox - A Tribute To Les Paul,Rock'n'Roll Jukebox: A Tribute To Les Paul - Jeff Beck - Screener,Batch 2 of Screeners/BATCH14/Rock'n'Roll Jukebox- A Tribute To Les Paul - Jeff Beck - 60' Screener.mp4,,,,new,
328,LennoNYC,01/01/2010,HD,1 x 115',LennoNYC,LennoNYC,LennoNYC - Screener,Batch 2 of Screeners/BATCH3/LennoNYC - Screener.mp4,LennoNYC,lennonyc.mp4,,483,
329,Peter Gabriel: Scratch My Back - Live At Verona Arena,01/01/2010,HD,1 x 70' ,Peter Gabriel,Scratch My Back - Live At Verona Arena,Scratch My Back: Live At Verona Arena - Peter Gabriel - Screener,Batch 2 of Screeners/BATCH14/Scratch My Back- Live At Verona Arena - Peter Gabriel - Screener.mp4,Scratch My Back - Live In Verona,peter-gabriel---scratch-my-back-1-clip.mp4,,216,
330,Peter Gabriel: Taking The Pulse - Live In Verona,01/01/2010,HD,1 x 90' ,Peter Gabriel,Taking The Pulse - Live In Verona,Taking The Pulse: Live In Verona - Peter Gabriel - Screener,Batch 2 of Screeners/BATCH3/Taking The Pulse - Live In Verona - Peter Gabriel - Screener.mp4,Taking The Pulse - Live In Verona,peter-gabriel---taking-the-pulse.mp4,,215,
331,Phil Collins: Going Back To Detroit,01/01/2010,HD,1 x 60' ,Phil Collins,Going Back To Detroit,Going Back To Detroit - Phil Collins - Screener,Batch 2 of Screeners/BATCH3/Going Back To Detroit - Phil Collins - Screener.mp4,Going Back To Detroit,phil-collins---going-back-to-detroit.mp4,,135,
333,Primal Scream: Rock Set,01/01/2010,HD,1 x 60' ,Primal Scream,Rock Set,Rock Set - Primal Scream - Screener,Batch 2 of Screeners/BATCH3/Rock Set - Primal Scream - Screener.mp4,Rocks,primal-scream-rock-set.mp4,,18,
334,Primal Scream: Screamadelica - Live At Olympia,01/01/2010,HD,1 x 75' ,Primal Scream,Screamadelica - Live At Olympia,Screamadelica: Live At Olympia - Primal Scream - Screener,Batch 2 of Screeners/BATCH4/Screamadelica - Live At Olympia - Primal Scream - Screener.mp4,Movin' On Up,primal-scream-screamadelica---live-at-olympia.mp4,,23,
335,Rage Against The Machine: Live At Finsbury Park ,01/01/2010,HD,1 x 70' ,Rage Against The Machine,Live At Finsbury Park,Live At Finsbury Park - Rage Against The Machine - Screener,Batch 2 of Screeners/BATCH4/Live At Finsbury Park - Rage Against The Machine - Screener.mp4,Killing In The Name,rage-against-the-machine---killing-in-the-name.mp4,,141,
336,Rory Gallagher: Ghost Blues,01/01/2010,SD,1 x 60' ,Rory Gallagher,Ghost Blues,Ghost Blues - Rory Gallagher - Screener,Batch 2 of Screeners/BATCH4/Ghost Blues - Rory Gallagher - Screener.mp4,,,,new,
337,Sheryl Crow: Miles From Memphis,01/01/2010,HD,1 x 60' / 1 x 1'  ,Sheryl Crow,Miles From Memphis,Miles From Memphis - Sheryl Crow - Screener,Batch 2 of Screeners/BATCH4/Miles From Memphis - Sheryl Crow - 60' Screener.mp4,,,,new,
338,Stone Temple Pilots: Live In Chicago,01/01/2010,HD,1 x 90'  ,Stone Temple Pilots,Live In Chicago,Live In Chicago - Stone Temple Pilots - Screener,Batch 2 of Screeners/BATCH4/Live In Chicago - Stone Temple Pilots - Screener.mp4,Plush,stone-temple-pilots---live-in-chicago---plush.mp4,,117,
340,Velvet Revolver: Live in Houston,01/01/2010,HD,1 x 90'  ,Velvet Revolver,Live in Houston,Live in Houston - Velvet Revolver - Screener,Batch 2 of Screeners/BATCH4/Live in Houston - Velvet Revolver - Screener.mp4,Slither,velvet-revolver---slither-houston.mp4,,191,
308,Il Divo: Live In Barcelona,01/01/2009,HD,1 x 60'  ,Il Divo,Live In Barcelona,Live In Barcelona - Il Divo - Screener,Batch 2 of Screeners/BATCH14/Live In Barcelona - Il Divo - Screener.mp4,Hallelujah,il-divo---live-in-barcelona---hallelujah-(0).mp4,,53,
309,Journey: Live In Manila,01/01/2009,HD,1 x 150',Journey,Live In Manila,Live In Manila - Journey - Screener,Batch 2 of Screeners/BATCH4/Live In Manila - Journey - Screener.mp4,Journey - Don't Stop Believing ,journey---dont-stop-believing---website.mp4,,369,
310,Madeleine Peyroux: Somethin' Grand - A Portrait Of Madeleine Peyroux,01/01/2009,HD,1 x 60',Madeleine Peyroux,Somethin' Grand - A Portrait Of Madeleine Peyroux,Somethin' Grand: A Portrait Of Madeleine Peyroux - Madeleine Peyroux - Screener,Batch 2 of Screeners/BATCH15/Somethin' Grand- A Portrait Of Madeleine Peyroux - Madeleine Peyroux - Screener.mp4,Madeleine Peyroux: Somethin' Grand - A Portrait Of Madeleine Peyroux,mad-p-doco-clip-1.mp4,,298,
311,Madeleine Peyroux: Somethin' Grand - Live In Los Angeles,01/01/2009,SD,1 x 55',Madeleine Peyroux,Somethin' Grand - Live In Los Angeles,Somethin' Grand: Live In Los Angeles - Madeleine Peyroux - Screener,Batch 2 of Screeners/BATCH15/Somethin' Grand- Live In Los Angeles - Madeleine Peyroux - Screener.mp4,Madeleine Peyroux: Somethin' Grand - Live In Los Angeles,madeleine-p-concert-clip-website-1.m4v,,299,
312,Michael Bolton: Live At The Royal Albert Hall,01/01/2009,"HD, SD",1 x 60' ,Michael Bolton,Live At The Royal Albert Hall,Live At The Royal Albert Hall - Michael Bolton - Screener,Batch 2 of Screeners/BATCH4/Live At The Royal Albert Hall - Michael Bolton - Screener.mp4,How Can We Be Lovers,michael-bolton---live-at-the-royal-albert-hall---how-can-we-be-lovers.mp4,,54,
315,Rick Wakeman The Six Wives of Henry VIII,01/01/2009,HD,1 x 60' / 1 x 1' ,Rick Wakeman The Six Wives of Henry VIII,Rick Wakeman The Six Wives of Henry VIII,Rick Wakeman The Six Wives of Henry VIII - Screener,Batch 2 of Screeners/BATCH14/Rick Wakeman The Six Wives of Henry VIII - 60' Screener.mp4,Jane Seymour,rick-wakeman---jane-seymour---hampton-court.mp4,,173,
316,Status Quo: Pictures - Live at Montreux,01/01/2009,HD,1 x 60' / 1 x 90'   ,Status Quo,Pictures - Live at Montreux,Pictures: Live at Montreux 2009 - Status Quo - Screener,Batch 2 of Screeners/BATCH4/Pictures - Live at Montreux 2009 - Status Quo - 60' Screener.mp4,Status Quo Pictures  Live at Montreux ,status-quo-pictures--live-at-montreux-trim.mp4,,45,
318,The Killers: Live At The Royal Albert Hall,01/01/2009,HD,1 x 60' / 1 x 90',The Killers,Live At The Royal Albert Hall,Live At The Royal Albert Hall - The Killers - Screener,Batch 2 of Screeners/BATCH4/Live At The Royal Albert Hall - The Killers - 60' Screener.mp4,The Killers - Somebody Told Me,the-killers---somebody-told-me---website-promo.mp4,,363,
320,Yeah Yeah Yeahs: Live From London,01/01/2009,SD,1 x 80' ,Yeah Yeah Yeahs,Live From London,Live From London - Yeah Yeah Yeahs - Screener,Batch 2 of Screeners/BATCH4/Live From London - Yeah Yeah Yeahs - Screener.mp4,Yeah Yeah Yeahs: Live From London,yeah-yeah-yeahs-brixton.mp4,,271,
286,A Technicolor Dream,01/01/2008,HD,1 x 60' / 1 x 90'   ,A Technicolor Dream,A Technicolor Dream,A Technicolor Dream - Screener,Batch 2 of Screeners/BATCH4/A Technicolor Dream - 60' Screener.mp4,A Technicolor Dream,a-technicolor-dream.mp4,,91,
290,Diana Krall: Live In Rio,01/01/2008,HD,1 x 60'  ,Diana Krall,Live In Rio,Live In Rio - Diana Krall - Screener,Batch 2 of Screeners/BATCH4/Live In Rio - Diana Krall - Screener.mp4,Este Seu Olhar,diana-krall---live-in-rio.mp4,,155,
291,Down The Tracks: The Music That Influenced Bob Dylan,01/01/2008,HD,1 x 60' / 1 x 90'   ,Down The Tracks,The Music That Influenced Bob Dylan,Down The Tracks: The Music That Influenced Bob Dylan - Screener,Batch 2 of Screeners/BATCH4/Down The Tracks - The Music That Influenced Bob Dylan - 60' Screener.mp4,The Music That Influenced Bob Dylan,bob-dylan---down-the-tracks-fg.mp4,,97,